Reaction Details
TargetDual specificity calcium/calmodulin-dependent 3',5'-cyclic nucleotide phosphodiesterase 1A
LigandBDBM278976
Substrate/Competitorn/a
Meas. Tech.PDE1 Inhibition Assay
pH7.6±n/a
Temperature298.15±n/a K
IC50 4.80±n/a nM
Commentsextracted
Citation Kehler, JJuhl, KMarigo, MVital, PJJessing, MLanggård, MRasmussen, LKClementson, CM 1H-pyrazolo[4,3-b]pyridines as PDE1 inhibitors US Patent US10034861 Publication Date 7/31/2018
 
Dual specificity calcium/calmodulin-dependent 3',5'-cyclic nucleotide phosphodiesterase 1A
Name:Dual specificity calcium/calmodulin-dependent 3',5'-cyclic nucleotide phosphodiesterase 1A
Type:Protein
Mol. Mass.:61245.69
Organism:Homo sapiens (Human)
Description:P54750
Residue:535
BDBM278976
NameBDBM278976
Synonyms:5-(2-ethoxy-3-pyridyl)-1-isopropyl-3-methyl-N-[(1-methyltriazol-4-yl)methyl]pyrazolo[4,3-b]pyridin-7-amine US10512632, Example 6 US10806718, Example 6 US11491140, Example 6 | US11634416, Example 6
TypeSmall organic molecule
Emp. Form.C21H26N8O
Mol. Mass.406.4841
SMILESCCOc1ncccc1-c1cc(NCc2cn(C)nn2)c2n(nc(C)c2n1)C(C)C