Reaction Details
TargetDual specificity calcium/calmodulin-dependent 3',5'-cyclic nucleotide phosphodiesterase 1C
LigandBDBM279047
Substrate/Competitorn/a
Meas. Tech.PDE1 Inhibition Assay
pH7.6±n/a
Temperature298.15±n/a K
IC50 64.0±n/a nM
Commentsextracted
Citation Kehler, JJuhl, KMarigo, MVital, PJJessing, MLanggård, MRasmussen, LKClementson, CM 1H-pyrazolo[4,3-b]pyridines as PDE1 inhibitors US Patent US10034861 Publication Date 7/31/2018
 
Dual specificity calcium/calmodulin-dependent 3',5'-cyclic nucleotide phosphodiesterase 1C
Name:Dual specificity calcium/calmodulin-dependent 3',5'-cyclic nucleotide phosphodiesterase 1C
Type:Enzyme
Mol. Mass.:80778.58
Organism:Homo sapiens (Human)
Description:Q14123
Residue:709
BDBM279047
NameBDBM279047
Synonyms:5-(2-ethoxy-3-pyridyl)-1-isopropyl-3-methyl-N-[[2-(trifluoromethyl)-3-pyridyl]methyl]pyrazolo[4,3-b]pyridin-7-amine US10512632, Example 77 US10806718, Example 77 US11491140, Example 77 | US11634416, Example 77
TypeSmall organic molecule
Emp. Form.C24H25F3N6O
Mol. Mass.470.4901
SMILESCCOc1ncccc1-c1cc(NCc2cccnc2C(F)(F)F)c2n(nc(C)c2n1)C(C)C