Reaction Details
TargetDual specificity calcium/calmodulin-dependent 3',5'-cyclic nucleotide phosphodiesterase 1A
LigandBDBM279096
Substrate/Competitorn/a
Meas. Tech.PDE1 Inhibition Assay
pH7.6±n/a
Temperature298.15±n/a K
IC50 1.80±n/a nM
Commentsextracted
Citation Kehler, JJuhl, KMarigo, MVital, PJJessing, MLanggård, MRasmussen, LKClementson, CM 1H-pyrazolo[4,3-b]pyridines as PDE1 inhibitors US Patent US10034861 Publication Date 7/31/2018
 
Dual specificity calcium/calmodulin-dependent 3',5'-cyclic nucleotide phosphodiesterase 1A
Name:Dual specificity calcium/calmodulin-dependent 3',5'-cyclic nucleotide phosphodiesterase 1A
Type:Protein
Mol. Mass.:61245.69
Organism:Homo sapiens (Human)
Description:P54750
Residue:535
BDBM279096
NameBDBM279096
Synonyms:5-(2-ethoxy-3-pyridyl)-3-methyl-1-[1-methylpropyl]-N-[(2-methyltetrazol-5-yl)methyl]pyrazolo[4,3-b]pyridin-7-amine,enantiomer 2 US10512632, Example 127 US10806718, Example 127 | US11634416, Example 127
TypeSmall organic molecule
Emp. Form.C21H27N9O
Mol. Mass.421.4988
SMILESCCOc1ncccc1-c1cc(NCc2nnn(C)n2)c2n(nc(C)c2n1)C(C)CC