Reaction Details
TargetDual specificity calcium/calmodulin-dependent 3',5'-cyclic nucleotide phosphodiesterase 1C
LigandBDBM279124
Substrate/Competitorn/a
Meas. Tech.PDE1 Inhibition Assay
pH7.6±n/a
Temperature298.15±n/a K
IC50 3.90±n/a nM
Commentsextracted
Citation Kehler, JJuhl, KMarigo, MVital, PJJessing, MLanggård, MRasmussen, LKClementson, CM 1H-pyrazolo[4,3-b]pyridines as PDE1 inhibitors US Patent US10034861 Publication Date 7/31/2018
 
Dual specificity calcium/calmodulin-dependent 3',5'-cyclic nucleotide phosphodiesterase 1C
Name:Dual specificity calcium/calmodulin-dependent 3',5'-cyclic nucleotide phosphodiesterase 1C
Type:Enzyme
Mol. Mass.:80778.58
Organism:Homo sapiens (Human)
Description:Q14123
Residue:709
BDBM279124
NameBDBM279124
Synonyms:3-[1-isopropyl-3-methyl-7-[(1-methylpyrazol-4-yl)methylamino]pyrazolo[4,3-b]pyridin-5-yl]-4-methyl-oxazolidin-2-one US10512632, Example 155 US10806718, Example 155 US11491140, Example 155 | US11634416, Example 155
TypeSmall organic molecule
Emp. Form.C19H25N7O2
Mol. Mass.383.4475
SMILESCC(C)n1nc(C)c2nc(cc(NCc3cnn(C)c3)c12)N1C(C)COC1=O