Reaction Details
TargetDual specificity calcium/calmodulin-dependent 3',5'-cyclic nucleotide phosphodiesterase 1C
LigandBDBM279135
Substrate/Competitorn/a
Meas. Tech.PDE1 Inhibition Assay
pH7.6±n/a
Temperature298.15±n/a K
IC50 7.20±n/a nM
Commentsextracted
Citation Kehler, JJuhl, KMarigo, MVital, PJJessing, MLanggård, MRasmussen, LKClementson, CM 1H-pyrazolo[4,3-b]pyridines as PDE1 inhibitors US Patent US10034861 Publication Date 7/31/2018
 
Dual specificity calcium/calmodulin-dependent 3',5'-cyclic nucleotide phosphodiesterase 1C
Name:Dual specificity calcium/calmodulin-dependent 3',5'-cyclic nucleotide phosphodiesterase 1C
Type:Enzyme
Mol. Mass.:80778.58
Organism:Homo sapiens (Human)
Description:Q14123
Residue:709
BDBM279135
NameBDBM279135
Synonyms:5-(2-ethoxy-3-pyridyl)-N-[[5-(fluoromethyl)isoxazol-3-yl]methyl]-1-isopropyl-3-methyl-pyrazolo[4,3-b]pyridin-7-amine US10034861, Example 166 US10766893, Example S166 US11026923, Example 166 US11634416, Example 166
TypeSmall organic molecule
Emp. Form.C22H25FN6O2
Mol. Mass.424.4713
SMILESCCOc1ncccc1-c1cc(NCc2cc(CF)on2)c2n(nc(C)c2n1)C(C)C