Reaction Details
TargetPhosphodiesterase
LigandBDBM14754
Substrate/Competitorn/a
Meas. Tech.Enzymatic Assay
pH7.5±0
Temperature297.15±0 K
IC50 2.5e+4±n/a nM
Citation Wang, HKunz, SChen, GSeebeck, TWan, YRobinson, HMartinelli, SKe, H Biological and structural characterization of Trypanosoma cruzi phosphodiesterase C and Implications for design of parasite selective inhibitors. J Biol Chem287:11788-97 (2012) 
 
Phosphodiesterase
Name:Phosphodiesterase
Type:Protein
Mol. Mass.:103074.59
Organism:Trypanosoma cruzi
Description:Q53I59
Residue:924
BDBM14754
NameBDBM14754
Synonyms:1-[(3,4-dimethoxyphenyl)methyl]-6,7-dimethoxy-isoquinoline 6,7-dimethoxy-1-veratryl-isoquinoline;hydrochloride Papaverine
TypeSmall organic molecule
Emp. Form.C20H21NO4
Mol. Mass.339.385
SMILESCOc1ccc(Cc2nccc3cc(OC)c(OC)cc23)cc1OC