Reaction Details
TargetPancreatic alpha-amylase
LigandBDBM92362
Substrate/Competitorn/a
Meas. Tech.Enzymatic Activity Assay
pH7±0
Temperature310.15±0 K
Ki 7.80e+5± 3.54e+3 nM
IC50 3.61e+5± 4.4e+4 nM
Citation Senger, MRGomes, Lda CFerreira, SBKaiser, CRFerreira, VFSilva, FP Kinetics Studies on the Inhibition Mechanism of Pancreatic α-Amylase by Glycoconjugated 1H-1,2,3-Triazoles: A New Class of Inhibitors with Hypoglycemiant Activity. Chembiochem13:1584-93 (2012) 
 
Pancreatic alpha-amylase
Name:Pancreatic alpha-amylase
Type:Protein
Mol. Mass.:57088.07
Organism:Sus scrofa (Pig)
Description:P00690
Residue:511
BDBM92362
NameBDBM92362
Synonyms:GPESB01
TypeSmall organic molecule
Emp. Form.C17H21N3O4
Mol. Mass.331.3663
SMILESCO[C@@H]1O[C@H](Cn2cc(nn2)-c2ccccc2)[C@@H]2OC(C)(C)OC12