Reaction Details
TargetGlutaminyl-peptide cyclotransferase
LigandBDBM7887
Substrate/CompetitorBDBM92450
Meas. Tech.Inhibitor Assay
pH8±0
Temperature298.15±0 K
Ki 607± 89 nM
Citation Huang, KFLiaw, SSHuang, WLChia, CYLo, YCChen, YLWang, AH Structures of human Golgi-resident glutaminyl cyclase and its complexes with inhibitors reveal a large loop movement upon inhibitor binding. J Biol Chem286:12439-49 (2011) 
 
Glutaminyl-peptide cyclotransferase
Name:Glutaminyl-peptide cyclotransferase
Type:Enzyme
Mol. Mass.:40877.05
Organism:Homo sapiens (Human)
Description:Q16769
Residue:361
BDBM7887
BDBM92450
NameBDBM7887
Synonyms:1-Benzylimidazole (BI) 1-benzylimidazole US9138393, 1-benzylimidazole
TypeSmall organic molecule
Emp. Form.C10H10N2
Mol. Mass.158.1998
SMILESC(c1ccccc1)n1ccnc1