Reaction Details
TargetTrehalose synthase/amylase TreS
LigandBDBM18351
Substrate/Competitorn/a
Meas. Tech.Inhibition Assay
Ki 2.5e+2±n/a nM
Citation Zhang, RPan, YTHe, SLam, MBrayer, GDElbein, ADWithers, SG Mechanistic analysis of trehalose synthase from Mycobacterium smegmatis. J Biol Chem286:35601-9 (2011) 
 
Trehalose synthase/amylase TreS
Name:Trehalose synthase/amylase TreS
Type:Protein
Mol. Mass.:68564.96
Organism:Mycobacterium tuberculosis
Description:P9WQ18
Residue:601
BDBM18351
NameBDBM18351
Synonyms:(2R,3R,4R,5S)-2-(Hydroxymethyl)piperidine-3,4,5-triol, 10 1-Deoxynojirimycin CHEMBL307429 US9181184, 1 | dNM
Typenatural product
Emp. Form.C6H13NO4
Mol. Mass.163.1717
SMILESOC[C@H]1NC[C@H](O)[C@@H](O)[C@@H]1O