Reaction Details
TargetAcid phosphatase
LigandBDBM15236
Substrate/Competitorn/a
Meas. Tech.Inhibitor Screening Assay
Ki 1.54e+5± 8.9e+4 nM
Citation McRae, SPagliai, FAMohapatra, NPGener, AMahmou, ASGunn, JSLorca, GLGonzalez, CF Inhibition of AcpA phosphatase activity with ascorbate attenuates Francisella tularensis intramacrophage survival. J Biol Chem285:5171-7 (2010) 
 
Acid phosphatase
Name:Acid phosphatase
Type:Enzyme
Mol. Mass.:22350.38
Organism:Francisella tularensis
Description:Q5NIC0
Residue:194
BDBM15236
NameBDBM15236
Synonyms:3,5,7-trihydroxy-2-(3,4,5-trihydroxyphenyl)-4H-chromen-4-one CHEMBL164 Myricetin Myricetin (Myr) | cid_5281672
TypeSmall organic molecule
Emp. Form.C15H10O8
Mol. Mass.318.2351
SMILESOc1cc(O)c2c(c1)oc(-c1cc(O)c(O)c(O)c1)c(O)c2=O