Reaction Details
TargetMatrix metalloproteinase-9
LigandBDBM92489
Substrate/Competitorn/a
Meas. Tech.Inhibition Assay
Temperature310.15±0 K
IC50>1.00e+5±n/a nM
Citation Radichev, IARemacle, AGShiryaev, SAPurves, ANJohnson, SLPellecchia, MStrongin, AY Biochemical characterization of the cellular glycosylphosphatidylinositol-linked membrane type-6 matrix metalloproteinase. J Biol Chem285:16076-86 (2010) 
 
Matrix metalloproteinase-9
Name:Matrix metalloproteinase-9
Type:Enzyme
Mol. Mass.:78452.28
Organism:Homo sapiens (Human)
Description:P14780
Residue:707
BDBM92489
NameBDBM92489
Synonyms:BI-102C8
TypeSmall organic molecule
Emp. Form.C15H15NO3
Mol. Mass.257.2845
SMILESCCOc1ccc(cc1)-c1ccccc1C(=O)NO