Reaction Details
TargetRAC-alpha serine/threonine-protein kinase
LigandBDBM92492
Substrate/Competitorn/a
Meas. Tech.TR-Fret Assay
IC50>3.0e+4±n/a nM
Citation Bobkova, EVWeber, MJXu, ZZhang, YLJung, JBlume-Jensen, PNorthrup, AKunapuli, PAndersen, JNKariv, I Discovery of PDK1 kinase inhibitors with a novel mechanism of action by ultrahigh throughput screening. J Biol Chem285:18838-46 (2010) 
 
RAC-alpha serine/threonine-protein kinase
Name:RAC-alpha serine/threonine-protein kinase
Type:Enzyme
Mol. Mass.:55681.25
Organism:Homo sapiens (Human)
Description:P31749
Residue:480
BDBM92492
NameBDBM92492
Synonyms:Alkaloid 1
TypeSmall organic molecule
Emp. Form.C26H34N4O3
Mol. Mass.450.5732
SMILESCCNC(=O)O[C@@H]1CC[C@@H]2[C@H](C[C@H]1N2Cc1ccccc1)C(=O)Nc1ccc(cc1)N(C)C