Reaction Details
TargetMethyl-accepting chemotaxis protein NahY
LigandBDBM26122
Substrate/Competitorn/a
Meas. Tech.Isothermal Titration Calorimetry
Temperature293.15±0 K
Kd 1.7e+4±n/a nM
Citation Lacal, JAlfonso, CLiu, XParales, REMorel, BConejero-Lara, FRivas, GDuque, ERamos, JLKrell, T Identification of a chemoreceptor for tricarboxylic acid cycle intermediates: differential chemotactic response towards receptor ligands. J Biol Chem285:23126-36 (2010) 
 
Methyl-accepting chemotaxis protein NahY
Name:Methyl-accepting chemotaxis protein NahY
Type:Protein
Mol. Mass.:58698.14
Organism:Pseudomonas putida (Arthrobacter siderocapsulatus)
Description:Q9Z429
Residue:538
BDBM26122
NameBDBM26122
Synonyms:(2E)-but-2-enedioic acid Fumarate | fumarate, 10
TypeSmall organic molecule
Emp. Form.C4H4O4
Mol. Mass.116.0722
SMILESOC(=O)\C=C\C(O)=O