Reaction Details
TargetAurora kinase A
LigandBDBM13534
Substrate/Competitorn/a
Meas. Tech.Radiometric Assay
IC50 20.0±3.7 nM
Citation Scutt, PJChu, MLSloane, DACherry, MBignell, CRWilliams, DHEyers, PA Discovery and exploitation of inhibitor-resistant aurora and polo kinase mutants for the analysis of mitotic networks. J Biol Chem284:15880-93 (2009) 
 
Aurora kinase A
Name:Aurora kinase A
Type:Serine/threonine-protein kinase
Mol. Mass.:45830.98
Organism:Homo sapiens (Human)
Description:O14965
Residue:403
BDBM13534
NameBDBM13534
Synonyms:CHEMBL572878 N-[4-[[4-(4-methylpiperazino)-6-[(5-methyl-1H-pyrazol-3-yl)amino]pyrimidin-2-yl]thio]phenyl]cyclopropanecarboxamide VX680 | cyclopropane carboxylic acid {4-[4-(4-methyl-piperazin-1-yl)-6-(5-methyl-2H-pyrazol-3-ylamino)-pyrimidin-2ylsulphanyl]-phenyl}-amide
TypeSmall organic molecule
Emp. Form.C23H28N8OS
Mol. Mass.464.586
SMILESCN1CCN(CC1)c1cc(Nc2cc(C)n[nH]2)nc(Sc2ccc(NC(=O)C3CC3)cc2)n1