Reaction Details
TargetCytochrome P450 130
LigandBDBM92571
Substrate/Competitorn/a
Meas. Tech.Binding Assay
Kd 1.34e+3± 8e+1 nM
Citation Podust, LMOuellet, Hvon Kries, JPde Montellano, PR Interaction of Mycobacterium tuberculosis CYP130 with heterocyclic arylamines. J Biol Chem284:25211-9 (2009) 
 
Cytochrome P450 130
Name:Cytochrome P450 130
Type:Enzyme
Mol. Mass.:44574.98
Organism:Mycobacterium tuberculosis
Description:P9WPN4
Residue:405
BDBM92571
NameBDBM92571
Synonyms:Arylamine compound 5
TypeSmall organic molecule
Emp. Form.C24H17N5O
Mol. Mass.391.4247
SMILESNc1ccc(Oc2ccc3nc(-c4ccccn4)c(nc3c2)-c2ccccn2)cc1