Reaction Details
TargetEpidermal growth factor receptor
LigandBDBM19459
Substrate/Competitorn/a
Meas. Tech.Kinase Assay
IC50 1e+3±n/a nM
Citation Geissler, JFTraxler, PRegenass, UMurray, BJRoesel, JLMeyer, TMcGlynn, EStorni, ALydon, NB Thiazolidine-diones. Biochemical and biological activity of a novel class of tyrosine protein kinase inhibitors. J Biol Chem265:22255-61 (1990) Epidermal growth factor receptor
Name:Epidermal growth factor receptor
Type:Receptor Kinase Domain
Mol. Mass.:134279.59
Organism:Homo sapiens (Human)
Description:P00533
Residue:1210
BDBM19459
NameBDBM19459
Synonyms:5,7-dihydroxy-3-(4-hydroxyphenyl)-4H-chromen-4-one Genistein Genisteol US8552057, 2 | cid_5280961
TypePhytoestrogen
Emp. Form.C15H10O5
Mol. Mass.270.2369
SMILESOc1ccc(cc1)-c1coc2cc(O)cc(O)c2c1=O