Reaction Details
TargetCasein kinase II subunit alpha
LigandBDBM92674
Substrate/Competitorn/a
Meas. Tech.Enzyme Assay
pH7.4±0
Temperature303.15±0 K
IC50 9.0e+4±n/a nM
Citation Chijiwa, THagiwara, MHidaka, H A newly synthesized selective casein kinase I inhibitor, N-(2-aminoethyl)-5-chloroisoquinoline-8-sulfonamide, and affinity purification of casein kinase I from bovine testis. J Biol Chem264:4924-7 (1989) Casein kinase II subunit alpha
Name:Casein kinase II subunit alpha
Type:Enzyme
Mol. Mass.:45151.12
Organism:Homo sapiens (Human)
Description:P68400
Residue:391
BDBM92674
NameBDBM92674
Synonyms:Isoquinolinesulfonamide, CKI-7
TypeSmall molecule
Emp. Form.C11H12ClN3O2S
Mol. Mass.285.75
SMILESNCCNS(=O)(=O)c1ccc(Cl)c2ccncc12