Reaction Details
TargetProlyl 4-hydroxylase subunit alpha-1
LigandBDBM50100861
Substrate/Competitorn/a
Meas. Tech.Inhibition Assay
Ki 5000±0.0 nM
Citation Majamaa, KGünzler, VHanauske-Abel, HMMyllylä, RKivirikko, KI Partial identity of the 2-oxoglutarate and ascorbate binding sites of prolyl 4-hydroxylase. J Biol Chem261:7819-23 (1986) Prolyl 4-hydroxylase subunit alpha-1
Name:Prolyl 4-hydroxylase subunit alpha-1
Type:Protein
Mol. Mass.:59433.79
Organism:Gallus gallus (Chicken)
Description:P16924
Residue:516
BDBM50100861
NameBDBM50100861
Synonyms:3,4-Dihydroxybenzoate, VIII 4,5-Dihydroxybenzoic acid CHEMBL37537 Protocatechuic acid (M1) cid_72
TypeSmall organic molecule
Emp. Form.C7H6O4
Mol. Mass.154.1201
SMILESOC(=O)c1ccc(O)c(O)c1