Reaction Details
TargetProlyl 4-hydroxylase subunit alpha-1
LigandBDBM50085536
Substrate/Competitorn/a
Meas. Tech.Inhibition Assay
Ki 30000±0.0 nM
Citation Majamaa, KGünzler, VHanauske-Abel, HMMyllylä, RKivirikko, KI Partial identity of the 2-oxoglutarate and ascorbate binding sites of prolyl 4-hydroxylase. J Biol Chem261:7819-23 (1986) Prolyl 4-hydroxylase subunit alpha-1
Name:Prolyl 4-hydroxylase subunit alpha-1
Type:Protein
Mol. Mass.:59433.79
Organism:Gallus gallus (Chicken)
Description:P16924
Residue:516
BDBM50085536
NameBDBM50085536
Synonyms:3,4,5-Trihydroxybenzoate, X CHEMBL288114 gallic acid
TypeSmall organic molecule
Emp. Form.C7H6O5
Mol. Mass.170.1195
SMILESOC(=O)c1cc(O)c(O)c(O)c1