Reaction Details
TargetAcyl-protein thioesterase 1
LigandBDBM50282567
Substrate/Competitorn/a
Meas. Tech.Enzymatic Protein Activity Assay
IC50 1.1e+3± 2e+2 nM
Citation Zimmermann, TJBürger, MTashiro, EKondoh, YMartinez, NEGörmer, KRosin-Steiner, SShimizu, TOzaki, SMikoshiba, KWatanabe, NHall, DVetter, IROsada, HHedberg, CWaldmann, H Boron-based inhibitors of acyl protein thioesterases 1 and 2. Chembiochem14:115-22 (2013) 
 
Acyl-protein thioesterase 1
Name:Acyl-protein thioesterase 1
Type:Protein
Mol. Mass.:24670.33
Organism:Homo sapiens (Human)
Description:O75608
Residue:230
BDBM50282567
NameBDBM50282567
Synonyms:3,4-Dichlorophenyl boronic acid CHEMBL20776 | Phenylboronic acid, 9
TypeSmall organic molecule
Emp. Form.C6H5BCl2O2
Mol. Mass.190.82
SMILESOB(O)c1ccc(Cl)c(Cl)c1