Reaction Details
TargetAcyl-protein thioesterase 1
LigandBDBM92719
Substrate/Competitorn/a
Meas. Tech.Enzymatic Protein Activity Assay
IC50 2.6e+3± 1e+2 nM
Citation Zimmermann, TJBürger, MTashiro, EKondoh, YMartinez, NEGörmer, KRosin-Steiner, SShimizu, TOzaki, SMikoshiba, KWatanabe, NHall, DVetter, IROsada, HHedberg, CWaldmann, H Boron-based inhibitors of acyl protein thioesterases 1 and 2. Chembiochem14:115-22 (2013) 
 
Acyl-protein thioesterase 1
Name:Acyl-protein thioesterase 1
Type:Protein
Mol. Mass.:24670.33
Organism:Homo sapiens (Human)
Description:O75608
Residue:230
BDBM92719
NameBDBM92719
Synonyms:Phenylboronic acid, 12
TypeSmall molecule
Emp. Form.C30H34B2N2O3
Mol. Mass.492.225
SMILESNCCOB(c1ccccc1)c1cccc(COCc2cccc(c2)B(OCCN)c2ccccc2)c1