Reaction Details
TargetPentachlorophenol 4-monooxygenase
LigandBDBM92749
Substrate/Competitorn/a
Meas. Tech.Spectroscopic Assay
Kd<50±0.0 nM
Citation Hlouchova, KRudolph, JPietari, JMBehlen, LSCopley, SD Pentachlorophenol hydroxylase, a poorly functioning enzyme required for degradation of pentachlorophenol by Sphingobium chlorophenolicum. Biochemistry51:3848-60 (2012) 
 
Pentachlorophenol 4-monooxygenase
Name:Pentachlorophenol 4-monooxygenase
Type:Enzyme
Mol. Mass.:59980.30
Organism:Sphingobium chlorophenolicum
Description:P42535
Residue:538
BDBM92749
NameBDBM92749
Synonyms:Pentachlorophenol (PCP)
TypeSmall molecule
Emp. Form.C6HCl5O
Mol. Mass.266.337
SMILESOc1c(Cl)c(Cl)c(Cl)c(Cl)c1Cl