Reaction Details
TargetPentachlorophenol 4-monooxygenase
LigandBDBM92750
Substrate/Competitorn/a
Meas. Tech.Spectroscopic Assay
Kd 1.10e+4± 2.7e+3 nM
Citation Hlouchova, KRudolph, JPietari, JMBehlen, LSCopley, SD Pentachlorophenol hydroxylase, a poorly functioning enzyme required for degradation of pentachlorophenol by Sphingobium chlorophenolicum. Biochemistry51:3848-60 (2012) 
 
Pentachlorophenol 4-monooxygenase
Name:Pentachlorophenol 4-monooxygenase
Type:Enzyme
Mol. Mass.:59980.30
Organism:Sphingobium chlorophenolicum
Description:P42535
Residue:538
BDBM92750
NameBDBM92750
Synonyms:2,3,4,6-Tetrachlorophenol (TCP)
TypeSmall molecule
Emp. Form.C6H2Cl4O
Mol. Mass.231.891
SMILESOc1c(Cl)c(Cl)cc(Cl)c1Cl