Reaction Details
TargetPentachlorophenol 4-monooxygenase
LigandBDBM92751
Substrate/Competitorn/a
Meas. Tech.Spectroscopic Assay
Kd 4.2e+3± 9e+2 nM
Citation Hlouchova, KRudolph, JPietari, JMBehlen, LSCopley, SD Pentachlorophenol hydroxylase, a poorly functioning enzyme required for degradation of pentachlorophenol by Sphingobium chlorophenolicum. Biochemistry51:3848-60 (2012) 
 
Pentachlorophenol 4-monooxygenase
Name:Pentachlorophenol 4-monooxygenase
Type:Enzyme
Mol. Mass.:59980.30
Organism:Sphingobium chlorophenolicum
Description:P42535
Residue:538
BDBM92751
NameBDBM92751
Synonyms:Tetrachlorohydroquinone (TCHQ)
TypeSmall molecule
Emp. Form.C6H2Cl4O2
Mol. Mass.247.891
SMILESOc1c(Cl)c(Cl)c(O)c(Cl)c1Cl