Reaction Details
TargetPentachlorophenol 4-monooxygenase
LigandBDBM92752
Substrate/Competitorn/a
Meas. Tech.Spectroscopic Assay
Kd 7.0e+3± 4.8e+3 nM
Citation Hlouchova, KRudolph, JPietari, JMBehlen, LSCopley, SD Pentachlorophenol hydroxylase, a poorly functioning enzyme required for degradation of pentachlorophenol by Sphingobium chlorophenolicum. Biochemistry51:3848-60 (2012) 
 
Pentachlorophenol 4-monooxygenase
Name:Pentachlorophenol 4-monooxygenase
Type:Enzyme
Mol. Mass.:59980.30
Organism:Sphingobium chlorophenolicum
Description:P42535
Residue:538
BDBM92752
NameBDBM92752
Synonyms:2,4,6-Trichlorophenol (2,4,6-TriCP)
TypeSmall molecule
Emp. Form.C6H3Cl3O
Mol. Mass.197.446
SMILESOc1c(Cl)cc(Cl)cc1Cl