Reaction Details
TargetPentachlorophenol 4-monooxygenase
LigandBDBM92753
Substrate/Competitorn/a
Meas. Tech.Spectroscopic Assay
Kd 4.55e+4± 4.9e+3 nM
Citation Hlouchova, KRudolph, JPietari, JMBehlen, LSCopley, SD Pentachlorophenol hydroxylase, a poorly functioning enzyme required for degradation of pentachlorophenol by Sphingobium chlorophenolicum. Biochemistry51:3848-60 (2012) 
 
Pentachlorophenol 4-monooxygenase
Name:Pentachlorophenol 4-monooxygenase
Type:Enzyme
Mol. Mass.:59980.30
Organism:Sphingobium chlorophenolicum
Description:P42535
Residue:538
BDBM92753
NameBDBM92753
Synonyms:2,6-Dichlorophenol | 2,6-Dichlorophenol (2,6-DCP)
TypeSmall molecule
Emp. Form.C6H4Cl2O
Mol. Mass.163.001
SMILESOc1c(Cl)cccc1Cl