Reaction Details
TargetPentachlorophenol 4-monooxygenase
LigandBDBM91350
Substrate/Competitorn/a
Meas. Tech.Spectroscopic Assay
Kd>5.00e+5±n/a nM
Citation Hlouchova, KRudolph, JPietari, JMBehlen, LSCopley, SD Pentachlorophenol hydroxylase, a poorly functioning enzyme required for degradation of pentachlorophenol by Sphingobium chlorophenolicum. Biochemistry51:3848-60 (2012) 
 
Pentachlorophenol 4-monooxygenase
Name:Pentachlorophenol 4-monooxygenase
Type:Enzyme
Mol. Mass.:59980.30
Organism:Sphingobium chlorophenolicum
Description:P42535
Residue:538
BDBM91350
NameBDBM91350
Synonyms:3,4,5-trichlorophenol MLS002302993 cid_11859
TypeSmall organic molecule
Emp. Form.C6H3Cl3O
Mol. Mass.197.446
SMILESOc1cc(Cl)c(Cl)c(Cl)c1