Reaction Details
TargetPentachlorophenol 4-monooxygenase
LigandBDBM92754
Substrate/Competitorn/a
Meas. Tech.Spectroscopic Assay
Kd>5.00e+5±n/a nM
Citation Hlouchova, KRudolph, JPietari, JMBehlen, LSCopley, SD Pentachlorophenol hydroxylase, a poorly functioning enzyme required for degradation of pentachlorophenol by Sphingobium chlorophenolicum. Biochemistry51:3848-60 (2012) 
 
Pentachlorophenol 4-monooxygenase
Name:Pentachlorophenol 4-monooxygenase
Type:Enzyme
Mol. Mass.:59980.30
Organism:Sphingobium chlorophenolicum
Description:P42535
Residue:538
BDBM92754
NameBDBM92754
Synonyms:3,5-Dichlorphenol (3,5-DCP)
TypeSmall molecule
Emp. Form.C6H4Cl2O
Mol. Mass.163.001
SMILESOc1cc(Cl)cc(Cl)c1