Reaction Details
TargetPentachlorophenol 4-monooxygenase
LigandBDBM36301
Substrate/Competitorn/a
Meas. Tech.Spectroscopic Assay
Kd>1.000e+6±n/a nM
Citation Hlouchova, KRudolph, JPietari, JMBehlen, LSCopley, SD Pentachlorophenol hydroxylase, a poorly functioning enzyme required for degradation of pentachlorophenol by Sphingobium chlorophenolicum. Biochemistry51:3848-60 (2012) 
 
Pentachlorophenol 4-monooxygenase
Name:Pentachlorophenol 4-monooxygenase
Type:Enzyme
Mol. Mass.:59980.30
Organism:Sphingobium chlorophenolicum
Description:P42535
Residue:538
BDBM36301
NameBDBM36301
Synonyms:2-Chlorophenol (2-CP) | 2-chlorophenol
TypeGuest
Emp. Form.C6H5ClO
Mol. Mass.128.556
SMILESOc1ccccc1Cl