Reaction Details
TargetFatty-acid amide hydrolase 1
LigandBDBM26732
Substrate/Competitorn/a
Meas. Tech.Inhibition Assay
pH8±0
Temperature295.15±0 K
IC50 2.3±0.4 nM
Citation Tian, GPaschetto, KAGharahdaghi, FGordon, EWilkins, DELuo, XScott, CW Mechanism of inhibition of fatty acid amide hydrolase by sulfonamide-containing benzothiazoles: long residence time derived from increased kinetic barrier and not exclusively from thermodynamic potency. Biochemistry50:6867-78 (2011) 
 
Fatty-acid amide hydrolase 1
Name:Fatty-acid amide hydrolase 1
Type:Protein
Mol. Mass.:63071.19
Organism:Homo sapiens (Human)
Description:O00519
Residue:579
BDBM26732
NameBDBM26732
Synonyms:Benzothiazole-based analogue, 1 benzothiazole analogue, 16j
TypeSmall organic molecule
Emp. Form.C24H23N3O4S3
Mol. Mass.513.652
SMILESCOc1cccc2sc(nc12)-c1ccc(NC(=O)C2CCN(CC2)S(=O)(=O)c2cccs2)cc1