Reaction Details
TargetNociceptin receptor
LigandBDBM86258
Substrate/Competitorn/a
Ki 1000±n/a nM
CommentsPDSP_1250
Citation Mogil, JSPasternak, GW The molecular and behavioral pharmacology of the orphanin FQ/nociceptin peptide and receptor family. Pharmacol Rev53:381-415 (2001) Nociceptin receptor
Name:Nociceptin receptor
Type:Enzyme Catalytic Domain
Mol. Mass.:40499.09
Organism:MOUSE
Description:Nociceptin/Orphanin FQ, NOP receptor 0 MOUSE::P35377
Residue:367
BDBM86258
NameBDBM86258
Synonyms:CAS_23552-18-3 NSC_5980
TypeSmall organic molecule
Emp. Form.C17H19NO3
Mol. Mass.285.3377
SMILESCN1CCC23C4Oc5c2c(CC1C3C=CC4O)ccc5O