Reaction Details
TargetNociceptin receptor
LigandBDBM50032403
Substrate/Competitorn/a
Ki 1000±n/a nM
CommentsPDSP_1450
Citation Mogil, JSPasternak, GW The molecular and behavioral pharmacology of the orphanin FQ/nociceptin peptide and receptor family. Pharmacol Rev53:381-415 (2001) Nociceptin receptor
Name:Nociceptin receptor
Type:Enzyme Catalytic Domain
Mol. Mass.:40499.09
Organism:MOUSE
Description:Nociceptin/Orphanin FQ, NOP receptor 0 MOUSE::P35377
Residue:367
BDBM50032403
NameBDBM50032403
Synonyms:(Pentazocine) 6,11-Dimethyl-3-(3-methyl-but-2-enyl)-1,2 ,3,4,5,6-hexahydro-2,6-methano-benzo[d]azocin-8-ol (pentazocine)2-{4-[(2,4-Diamino-pteridin-6-ylmethyl)-methyl-amino]-benzoylamino}-pentanedioic acid 2-[3-cyclopropylmethyl-11-hydroxy-15-methoxy-(15S)-13-oxa-3-azahexacyclo[13.2.2.12,8.01,6.06,14.07,12]icosa-7,9,11-trien-16-yl]-3,3-dimethyl-2-butanol(Pentazocine) 6,11-Dimethyl-3-(3-methyl-but-2-enyl)-1,2,3,4,5,6-hexahydro-2,6-methano-benzo[d]azocin-8-ol (pentazocine) CHEMBL100116 PENTAZOCINE (+) | PENTAZOCINE (-)
TypeSmall organic molecule
Emp. Form.C19H27NO
Mol. Mass.285.4238
SMILES[#6]-[#6]1-[#6]-2-[#6]-c3ccc(-[#8])cc3C1([#6])[#6]-[#6]-[#7]-2-[#6]\[#6]=[#6](\[#6])-[#6]