Reaction Details
TargetPyrazinamidase/nicotinamidase, PncA protein
LigandBDBM92856
Substrate/Competitorn/a
Meas. Tech.GDH-Coupled Nicotinamidase Assay
Ki 2000000±0 nM
Citation French, JBCen, YVrablik, TLXu, PAllen, EHanna-Rose, WSauve, AA Characterization of nicotinamidases: steady state kinetic parameters, classwide inhibition by nicotinaldehydes, and catalytic mechanism. Biochemistry49:10421-39 (2010) 
 
Pyrazinamidase/nicotinamidase, PncA protein
Name:Pyrazinamidase/nicotinamidase, PncA protein
Type:Enzyme
Mol. Mass.:19332.49
Organism:Borrelia burgdorferi
Description:O50718
Residue:167
BDBM92856
NameBDBM92856
Synonyms:Nicotinamidase Inhibitor, 23 | PncA Inhibitor, 5
TypeSmalll molecule
Emp. Form.C6H4N2
Mol. Mass.104.1094
SMILESN#Cc1cccnc1