Reaction Details
TargetNicotinamidase
LigandBDBM92857
Substrate/Competitorn/a
Meas. Tech.GDH-Coupled Nicotinamidase Assay
Ki 46000±0 nM
Citation French, JBCen, YVrablik, TLXu, PAllen, EHanna-Rose, WSauve, AA Characterization of nicotinamidases: steady state kinetic parameters, classwide inhibition by nicotinaldehydes, and catalytic mechanism. Biochemistry49:10421-39 (2010) 
 
Nicotinamidase
Name:Nicotinamidase
Type:Enzyme
Mol. Mass.:24990.99
Organism:Saccharomyces cerevisiae
Description:P53184
Residue:216
BDBM92857
NameBDBM92857
Synonyms:Nicotinamidase Inhibitor, 24
TypeSmall molecule
Emp. Form.C7H7NO
Mol. Mass.121.1366
SMILESCC(=O)c1cccnc1