Reaction Details
TargetIsochorismatase family protein
LigandBDBM92853
Substrate/Competitorn/a
Meas. Tech.GDH-Coupled Nicotinamidase Assay
Ki 110000±0 nM
Citation French, JBCen, YVrablik, TLXu, PAllen, EHanna-Rose, WSauve, AA Characterization of nicotinamidases: steady state kinetic parameters, classwide inhibition by nicotinaldehydes, and catalytic mechanism. Biochemistry49:10421-39 (2010) 
 
Isochorismatase family protein
Name:Isochorismatase family protein
Type:Enzyme
Mol. Mass.:21361.69
Organism:Streptococcus pneumoniae
Description:A0A098ZGI7
Residue:191
BDBM92853
NameBDBM92853
Synonyms:Nicotinamidase Inhibitor, 20
TypeSmall molecule
Emp. Form.C6H4ClNO
Mol. Mass.141.555
SMILESClc1ncccc1C=O