Reaction Details
TargetIsochorismatase family protein
LigandBDBM92855
Substrate/Competitorn/a
Meas. Tech.GDH-Coupled Nicotinamidase Assay
Ki 50000±0 nM
Citation French, JBCen, YVrablik, TLXu, PAllen, EHanna-Rose, WSauve, AA Characterization of nicotinamidases: steady state kinetic parameters, classwide inhibition by nicotinaldehydes, and catalytic mechanism. Biochemistry49:10421-39 (2010) 
 
Isochorismatase family protein
Name:Isochorismatase family protein
Type:Enzyme
Mol. Mass.:21361.69
Organism:Streptococcus pneumoniae
Description:A0A098ZGI7
Residue:191
BDBM92855
NameBDBM92855
Synonyms:Nicotinamidase Inhibitor, 22
TypeSmall molecule
Emp. Form.C7H7NO2
Mol. Mass.137.136
SMILESCOc1ccncc1C=O