Reaction Details
TargetIsochorismatase family protein
LigandBDBM92857
Substrate/Competitorn/a
Meas. Tech.GDH-Coupled Nicotinamidase Assay
Ki 60000±0 nM
Citation French, JBCen, YVrablik, TLXu, PAllen, EHanna-Rose, WSauve, AA Characterization of nicotinamidases: steady state kinetic parameters, classwide inhibition by nicotinaldehydes, and catalytic mechanism. Biochemistry49:10421-39 (2010) 
 
Isochorismatase family protein
Name:Isochorismatase family protein
Type:Enzyme
Mol. Mass.:21361.69
Organism:Streptococcus pneumoniae
Description:A0A098ZGI7
Residue:191
BDBM92857
NameBDBM92857
Synonyms:Nicotinamidase Inhibitor, 24
TypeSmall molecule
Emp. Form.C7H7NO
Mol. Mass.121.1366
SMILESCC(=O)c1cccnc1