Reaction Details
TargetIsochorismatase domain-containing protein
LigandBDBM50026863
Substrate/Competitorn/a
Meas. Tech.GDH-Coupled Nicotinamidase Assay
Ki 110±10 nM
Citation French, JBCen, YVrablik, TLXu, PAllen, EHanna-Rose, WSauve, AA Characterization of nicotinamidases: steady state kinetic parameters, classwide inhibition by nicotinaldehydes, and catalytic mechanism. Biochemistry49:10421-39 (2010) 
 
Isochorismatase domain-containing protein
Name:Isochorismatase domain-containing protein
Type:Enzyme
Mol. Mass.:37789.90
Organism:Caenorhabditis elegans
Description:Q9N426
Residue:335
BDBM50026863
NameBDBM50026863
Synonyms:CHEMBL268493 PncA Inhibitor, 2 | Pyridine-3-carbaldehyde
TypeSmall organic molecule
Emp. Form.C6H5NO
Mol. Mass.107.11
SMILESO=Cc1cccnc1