Reaction Details
TargetAP2-associated protein kinase 1
LigandBDBM279455
Substrate/Competitorn/a
Meas. Tech.AAK1 Kinase Assay
pH7.4±n/a
Temperature298.15±n/a K
IC50 5.00±n/a nM
Commentsextracted
Citation Dzierba, CDBronson, JJMacor, JEDasgupta, BNara, SJVrudhula, VMPan, SHartz, RARajamani, R Heterocyclic kinase inhibitors US Patent US10035777 Publication Date 7/31/2018
 
AP2-associated protein kinase 1
Name:AP2-associated protein kinase 1
Type:PROTEIN
Mol. Mass.:103884.23
Organism:Homo sapiens (Human)
Description:ChEMBL_774569
Residue:961
BDBM279455
NameBDBM279455
Synonyms:(R)-1-(5-(1H-pyrrolo[2, 3-b]pyridin-4-yl)-1H-benzo[d]imidazol-2-yl)-3-methylbutan-1-amine | US10035777, Example 6
TypeSmall organic molecule
Emp. Form.C20H24BN3O4
Mol. Mass.381.233
SMILESCC(C)C[C@@H](NC(=O)OCc1ccccc1)c1nc2ccc(cc2[nH]1)B(O)O