Reaction Details
TargetGenome polyprotein
LigandBDBM92894
Substrate/Competitorn/a
Meas. Tech.Competitive Inhibition Assay
Ki 500±100 nM
Citation Dahl, GArenas, OGDanielson, UH Hepatitis C virus NS3 protease is activated by low concentrations of protease inhibitors. Biochemistry48:11592-602 (2009) 
 
Genome polyprotein
Name:Genome polyprotein
Synonyms:NS3 protein
Type:Protein
Mol. Mass.:45665.89
Organism:Hepatitis C virus
Description:Q04045
Residue:428
BDBM92894
NameBDBM92894
Synonyms:NS3 Protease Inhibitor, 5
TypeSmall molecule
Emp. Form.C31H40N4O8S
Mol. Mass.628.736
SMILESCC(=O)N[C@@H](C1CCCCC1)C(=O)N[C@@H](CCC(O)=O)C(=O)N[C@@H](Cc1ccc2ccccc2c1)C(=O)N[C@@H](CS)C(O)=O