Reaction Details
TargetIntegrin alpha-V/beta-6
LigandBDBM279572
Substrate/Competitorn/a
Meas. Tech.Solid Phase Receptor Assay (SPRA) for alphaVbeta6
pH7.4±n/a
Temperature298.15±n/a K
IC50 0.400±n/a nM
Commentsextracted
Citation Ruminski, PGGriggs, DW Meta-azacyclic amino benzoic acid derivatives as pan integrin antagonists US Patent US10035778 Publication Date 7/31/2018
 
Integrin alpha-V/beta-6
Name:Integrin alpha-V/beta-6
Type:Enzyme
Mol. Mass.:n/a
Description:n/a
Components:This complex has 2 components.
Component 1
Name:Integrin alpha-V
Synonyms:ITAV_HUMAN Integrin alpha-V/alpha-5 VNRA Vitronectin receptor | Vitronectin receptor subunit alpha
Type:PROTEIN
Mol. Mass.:116024.92
Organism:Homo sapiens (Human)
Description:ChEMBL_582336
Residue:1048
Component 2
Name:Integrin beta-6
Synonyms:ITB6_HUMAN | ITGB6
Type:PROTEIN
Mol. Mass.:85919.61
Organism:Homo sapiens (Human)
Description:EBI_10916
Residue:788
BDBM279572
NameBDBM279572
Synonyms:(3S)-3-[3-bromo-5-fluoro-phenyl)-3-(2-(3-hydroxy-5-((5-hydroxy-1,4,5,6-tetrahydropyrimidin-2-yl)amino)benzamido)acetamido)propanoic acid US10577330, Example 13
TypeSmall organic molecule
Emp. Form.C22H23BrFN5O6
Mol. Mass.552.35
SMILESOC1CNC(Nc2cc(O)cc(c2)C(=O)NCC(=O)N[C@@H](CC(O)=O)c2cc(F)cc(Br)c2)=NC1