Reaction Details
TargetIntegrin alpha-V/beta-6
LigandBDBM279573
Substrate/Competitorn/a
Meas. Tech.Solid Phase Receptor Assay (SPRA) for alphaVbeta6
pH7.4±n/a
Temperature298.15±n/a K
IC50 0.200±n/a nM
Commentsextracted
Citation Ruminski, PGGriggs, DW Meta-azacyclic amino benzoic acid derivatives as pan integrin antagonists US Patent US10035778 Publication Date 7/31/2018
 
Integrin alpha-V/beta-6
Name:Integrin alpha-V/beta-6
Type:Enzyme
Mol. Mass.:n/a
Description:n/a
Components:This complex has 2 components.
Component 1
Name:Integrin alpha-V
Synonyms:ITAV_HUMAN Integrin alpha-V/alpha-5 VNRA Vitronectin receptor | Vitronectin receptor subunit alpha
Type:PROTEIN
Mol. Mass.:116024.92
Organism:Homo sapiens (Human)
Description:ChEMBL_582336
Residue:1048
Component 2
Name:Integrin beta-6
Synonyms:ITB6_HUMAN | ITGB6
Type:PROTEIN
Mol. Mass.:85919.61
Organism:Homo sapiens (Human)
Description:EBI_10916
Residue:788
BDBM279573
NameBDBM279573
Synonyms:(3S)-3-(3,5-dibromophenyl)-3-[[2-[[5-[(5-hydroxy-1,4,5,6-tetrahydropyrimidin-2-yl)amino]pyridine-3-carbonyl]amino]acetyl]amino]propanoic acid US10577330, Example 14
TypeSmall organic molecule
Emp. Form.C21H22Br2N6O5
Mol. Mass.598.245
SMILESOC1CNC(Nc2cncc(c2)C(=O)NCC(=O)N[C@@H](CC(O)=O)c2cc(Br)cc(Br)c2)=NC1