Reaction Details
TargetIntegrin alpha-8/beta-1
LigandBDBM279575
Substrate/Competitorn/a
Meas. Tech.Solid Phase Receptor Assay (SPRA) for alpha8beta1
pH7.4±n/a
Temperature298.15±n/a K
IC50 0.500±n/a nM
Commentsextracted
Citation Ruminski, PGGriggs, DW Meta-azacyclic amino benzoic acid derivatives as pan integrin antagonists US Patent US10035778 Publication Date 7/31/2018
 
Integrin alpha-8/beta-1
Name:Integrin alpha-8/beta-1
Synonyms:ITGA8/ITGB1
Type:Enzyme
Mol. Mass.:n/a
Description:n/a
Components:This complex has 2 components.
Component 1
Name:Integrin alpha-8
Type:Enzyme Catalytic Domain
Mol. Mass.:117456.11
Organism:Homo sapiens (Human)
Description:n/a
Residue:1063
Component 2
Name:Integrin beta-1
Synonyms:CD_antigen=CD29 Fibronectin receptor beta GPIIA ITGB1 MDF2 | MSK12
Type:Enzyme
Mol. Mass.:88400.38
Organism:Homo sapiens (Human)
Description:P05556
Residue:798
BDBM279575
NameBDBM279575
Synonyms:(3S)-3-[3-chloro-5-(trifluoromethoxy)phenyl)-3-(2-(3-hydroxy-5-((5-hydroxy-1,4,5,6-tetrahydropyrimidin-2-yl)amino)benzamido)acetamido)propanoic acid US10577330, Example 16
TypeSmall organic molecule
Emp. Form.C23H23ClF3N5O7
Mol. Mass.573.906
SMILESOC1CNC(Nc2cc(O)cc(c2)C(=O)NCC(=O)N[C@@H](CC(O)=O)c2cc(Cl)cc(OC(F)(F)F)c2)=NC1