Reaction Details
TargetOxaloacetate decarboxylase
LigandBDBM92967
Substrate/Competitorn/a
Meas. Tech.Inhibition Assay
Ki 3000000±2000000 nM
Citation Narayanan, BCNiu, WHan, YZou, JMariano, PSDunaway-Mariano, DHerzberg, O Structure and function of PA4872 from Pseudomonas aeruginosa, a novel class of oxaloacetate decarboxylase from the PEP mutase/isocitrate lyase superfamily. Biochemistry47:167-82 (2008) 
 
Oxaloacetate decarboxylase
Name:Oxaloacetate decarboxylase
Type:Protein
Mol. Mass.:31314.95
Organism:Pseudomonas aeruginosa (strain ATCC 15692 / PAO1 / 1C / PRS 101 / LMG 12228)
Description:Q9HUU1
Residue:287
BDBM92967
NameBDBM92967
Synonyms:Phosphonopyruvate
TypeSmall molecule
Emp. Form.C3H2O6P
Mol. Mass.165.0198
SMILES[O-]C(=O)C(=O)CP([O-])([O-])=O