Reaction Details
TargetChymotrypsinogen A
LigandBDBM50004955
Substrate/Competitorn/a
Meas. Tech.Kinetic Assay
Ki 4500000±1400000 nM
Citation ABRASH, HINIEMANN, C INTERACTION OF AROMATIC COMPOUNDS WITH ALPHA-CHYMOTRYPSIN. II. COMBINATION OF THE ISOMERIC INDOLE CARBOXAMIDES AND CARBOXYLATE IONS WITH THE ACTIVE SITE. Biochemistry4:99-104 (1965) 
 
Chymotrypsinogen A
Name:Chymotrypsinogen A
Type:Serine protease
Mol. Mass.:25670.88
Organism:Bos taurus (bovine)
Description:n/a
Residue:245
BDBM50004955
NameBDBM50004955
Synonyms:1H-Indole-2-carboxylic acid Indol-2-carboxylic acid | Indole-2-carboxylate
TypeSmall organic molecule
Emp. Form.C9H7NO2
Mol. Mass.161.1574
SMILESOC(=O)c1cc2ccccc2[nH]1