Reaction Details
TargetCannabinoid receptor 2
LigandBDBM93026
Substrate/Competitorn/a
Meas. Tech.Competition Binding Assay
Ki 143±1 nM
Citation Renault, NLaurent, XFarce, AEl Bakali, JMansouri, RGervois, PMillet, RDesreumaux, PFurman, CChavatte, P Virtual Screening of CB2 Receptor Agonists from Bayesian Network and High-Throughput Docking: Structural Insights into Agonist-Modulated GPCR Features. Chem Biol Drug Des81:442-454 (2013) 
 
Cannabinoid receptor 2
Name:Cannabinoid receptor 2
Type:G Protein-Coupled Receptor (GPCR)
Mol. Mass.:39690.94
Organism:Homo sapiens (Human)
Description:P34972
Residue:360
BDBM93026
NameBDBM93026
Synonyms:CB2 Inhibitor, 2
Typen/a
Emp. Form.C22H21FN4O2S
Mol. Mass.424.491
SMILESCc1nn(Cc2ccc(F)cc2)c2sc(cc12)C(=O)NCc1c(C)cc(C)[nH]c1=O