Reaction Details
TargetCannabinoid receptor 2
LigandBDBM93036
Substrate/Competitorn/a
Meas. Tech.Competition Binding Assay
Ki 60900±19220 nM
Citation Renault, NLaurent, XFarce, AEl Bakali, JMansouri, RGervois, PMillet, RDesreumaux, PFurman, CChavatte, P Virtual Screening of CB2 Receptor Agonists from Bayesian Network and High-Throughput Docking: Structural Insights into Agonist-Modulated GPCR Features. Chem Biol Drug Des81:442-454 (2013) 
 
Cannabinoid receptor 2
Name:Cannabinoid receptor 2
Type:G Protein-Coupled Receptor (GPCR)
Mol. Mass.:39690.94
Organism:Homo sapiens (Human)
Description:P34972
Residue:360
BDBM93036
NameBDBM93036
Synonyms:CB2 Inhibitor, 12
TypeSmall molecule
Emp. Form.C23H25N3O4S2
Mol. Mass.471.592
SMILESCCCn1c(SCC(=O)NCC2COc3ccccc3O2)nc2sc3CCCc3c2c1=O