Reaction Details
TargetCannabinoid receptor 2
LigandBDBM93037
Substrate/Competitorn/a
Meas. Tech.Competition Binding Assay
Ki 71430±16300 nM
Citation Renault, NLaurent, XFarce, AEl Bakali, JMansouri, RGervois, PMillet, RDesreumaux, PFurman, CChavatte, P Virtual Screening of CB2 Receptor Agonists from Bayesian Network and High-Throughput Docking: Structural Insights into Agonist-Modulated GPCR Features. Chem Biol Drug Des81:442-454 (2013) 
 
Cannabinoid receptor 2
Name:Cannabinoid receptor 2
Type:G Protein-Coupled Receptor (GPCR)
Mol. Mass.:39690.94
Organism:Homo sapiens (Human)
Description:P34972
Residue:360
BDBM93037
NameBDBM93037
Synonyms:CB2 Inhibitor, 13
TypeSmall molecule
Emp. Form.C22H30N2OS
Mol. Mass.370.551
SMILESCN(C)C(CNC(=O)C1(Cc2ccccc2)CCCCC1)c1cccs1