Reaction Details
TargetDNA repair and recombination protein RadA
LigandBDBM50159250
Substrate/Competitorn/a
Meas. Tech.Thermal Denaturation Assay
Kd 460000±0.0 nM
Citation Scott, DEEhebauer, MTPukala, TMarsh, MBlundell, TLVenkitaraman, ARAbell, CHyvönen, M Using a fragment-based approach to target protein-protein interactions. Chembiochem14:332-42 (2013) 
 
DNA repair and recombination protein RadA
Name:DNA repair and recombination protein RadA
Type:Protein
Mol. Mass.:38398.93
Organism:Pyrococcus furiosus
Description:O74036
Residue:349
BDBM50159250
NameBDBM50159250
Synonyms:2-Naphthol CHEMBL14126 beta-hydroxynaphthalene | naphthalen-2-ol
TypeSmall organic molecule
Emp. Form.C10H8O
Mol. Mass.144.1699
SMILESOc1ccc2ccccc2c1