Reaction Details
TargetComplement C1s subcomponent
LigandBDBM93096
Substrate/Competitorn/a
Meas. Tech.Enzymatic Assay
pH8.05±0
Temperature298.65±0 K
Ki 2970000±0.0 nM
Citation Bing, DH Nature of the active site of a subunit of the first component of human complement. Biochemistry8:4503-10 (1969) 
 
Complement C1s subcomponent
Name:Complement C1s subcomponent
Type:Protein
Mol. Mass.:76657.91
Organism:Homo sapiens (Human)
Description:P09871
Residue:688
BDBM93096
NameBDBM93096
Synonyms:2-Guanidinobenzimidazole
TypeSmall molecule
Emp. Form.C9H11N5
Mol. Mass.189.2171
SMILESNC(=N)NC1=Nc2ccccc2NC1